tail -n12 "/Users/zayn/source/morphos-cross-toolchain/setup-cross-sdk.log"
/var/folders/zz/zyxvpxvq6csfxvn_n0000000000000/T/setupcrosssdk.HEZ1AwkY/gcc5/build/./gcc/xgcc -B/var/folders/zz/zyxvpxvq6csfxvn_n0000000000000/T/setupcrosssdk.HEZ1AwkY/gcc5/build/./gcc/ -B/opt/ppc-morphos/ppc-morphos/bin/ -B/opt/ppc-morphos/ppc-morphos/lib/ -isystem /opt/ppc-morphos/ppc-morphos/include -isystem /opt/ppc-morphos/ppc-morphos/sys-include -g -O2 -mbaserel32 -mstrict-align -O2 -g -O2 -DIN_GCC -DCROSS_DIRECTORY_STRUCTURE -W -Wall -Wno-narrowing -Wwrite-strings -Wcast-qual -Wstrict-prototypes -Wmissing-prototypes -Wold-style-definition -isystem ./include -g -DIN_LIBGCC2 -fbuilding-libgcc -fno-stack-protector -I. -I. -I../../.././gcc -I../../../../gcc-5.3.0/libgcc -I../../../../gcc-5.3.0/libgcc/. -I../../../../gcc-5.3.0/libgcc/../gcc -I../../../../gcc-5.3.0/libgcc/../include -DHAVE_CC_TLS -DUSE_EMUTLS -c eh_dummy.c
-o eh_dummy.o;
objects=eh_dummy.o;
fi;
/opt/ppc-morphos/ppc-morphos/bin/ar rc libgcc.a $objects
/bin/sh: line 1: 29062 Abort trap: 6 /opt/ppc-morphos/ppc-morphos/bin/ar rc libgcc.a $objects
make[5]: *** [libgcc.a] Error 134
make[4]: *** [multi-do] Error 1
make[3]: *** [all-multi] Error 2
make[2]: *** [all-target-libgcc] Error 2
make[1]: *** [all] Error 2
make: *** [build/.morphos-build-stamp] Error 2